{"text_format":"1","workbook":"xlsx","n_sheets":5,"sheets":["LED","CARD","TEST","NUM","TERM"],"not_rendered":{"charts":0,"images":8,"macros":1,"external_links":0,"defined_names":4,"comments":0,"pivot_tables":0},"unopened":[],"bounds":{"document_bytes":16777216,"sheet_cells":100000,"rows_first":2000,"rows_last":500,"rows_between":2000,"halvings":0,"cell_chars":16384,"cell_head_chars":4096},"cells_cut":0,"cells_raw":0,"read":"whole","date_system":"1900"}

{"sheet":"LED","index":0,"n_rows":19,"n_cols":17,"rows_kept":19,"cut":false,"hidden":false,"merged":[]}
[1,2,3,4,5,6,7,8,9,10,11]
[null,"No,","引数","値1","値2","値3","表示","コード","値1","値2","値3",null,null,null,null,{"$f":"P1+10","v":10},"'LED"]
[1,-1,"LRUN0",null,null,null,"LRUN 0",{"$f":"IF(B3=-1,C3,TRIM(TEXT(B3,\"00\")&TEXT(C3,\"0\")&\"/\"&I3&J3&K3))","v":"LRUN0"},{"$f":"IF(D3<>\"\",IF(D3=\"*\",\"\",D3&\"/\"),\"\")","v":""},{"$f":"IF(E3<>\"\",IF(E3=\"*\",\"\",E3&\"/\"),\"\")","v":""},{"$f":"IF(F3<>\"\",IF(F3=\"*\",\"\",F3&\"/\"),\"\")","v":""},null,null,null,null,{"$f":"P2+10","v":20},"CLS:?\"LED\":?:?:P=0"]
[2,-1,"N",null,null,null,"NEW",{"$f":"IF(B4=-1,C4,TRIM(TEXT(B4,\"00\")&TEXT(C4,\"0\")&\"/\"&I4&J4&K4))","v":"N"},{"$f":"IF(D4<>\"\",IF(D4=\"*\",\"\",D4&\"/\"),\"\")","v":""},"","",null,null,null,null,30,"@LP:IF(P>100)END"]
[3,-1,"E",null,null,null,"END",{"$f":"IF(B5=-1,C5,TRIM(TEXT(B5,\"00\")&TEXT(C5,\"0\")&\"/\"&I5&J5&K5))","v":"E"},"","","",null,null,null,null,40,"N=[P]:P=P+1:M=N-N/10*10:N=N/10"]
[4,-1,"R",null,null,null,"RUN","R","","","",null,0,"END","END",50,{"$f":"\"IFN=\"&M6&O6","v":"IFN=0END"}]
[5,1,1,"*",null,null,"ＬＥＤ","011/","","","",null,{"$f":"B7","v":1},{"$f":"G7","v":"ＬＥＤ"},"LED[P]",60,{"$f":"\"IFN=\"&M7&O7","v":"IFN=1LED[P]"}]
[6,2,1,"*",null,null,"（　）秒まつ","021/","","","",null,{"$f":"B8","v":2},{"$f":"G8","v":"（　）秒まつ"},"WAIT[P]*60",70,{"$f":"\"IFN=\"&M8&O8","v":"IFN=2WAIT[P]*60"}]
[7,70,0,null,null,null,"ここに","700/","","","",null,70,"ここに","O=P-1",80,"IFN=70O=P-1"]
[8,71,0,null,null,null,"もどる","710/","","","",null,71,"もどる","P=O:M=0",90,"IFN=71P=O:M=0"]
[9,72,1,"*",null,null,"くりかえし（　）回","721/","","","",null,72,"くりかえし（　）回","Q=P+M:R=[P]",100,"IFN=72Q=P+M:R=[P]"]
[10,73,0,null,null,null,"くりかえす","730/","","","",null,73,"くりかえす","R=R-1:IFR>0P=Q:M=0",110,"IFN=73R=R-1:IFR>0P=Q:M=0"]
[11,1,1,1,null,null,"ひかる","011/1/","1/","","",null,null,null,null,120,"P=P+M:GOTO@LP"]
[12,1,1,0,null,null,"けす",{"$f":"IF(B14=-1,C14,TRIM(TEXT(B14,\"00\")&TEXT(C14,\"0\")&\"/\"&I14&J14&K14))","v":"011/0/"},{"$f":"IF(D14<>\"\",IF(D14=\"*\",\"\",D14&\"/\"),\"\")","v":"0/"},{"$f":"IF(E14<>\"\",IF(E14=\"*\",\"\",E14&\"/\"),\"\")","v":""},{"$f":"IF(F14<>\"\",IF(F14=\"*\",\"\",F14&\"/\"),\"\")","v":""}]
[13,72,1,3,null,null,{"$f":"DBCS(D15)&\"回\"","v":"３回"},"721/3/","3/","",""]
[14,72,1,5,null,null,{"$f":"DBCS(D16)&\"回\"","v":"５回"},"721/5/","5/","",""]
[15,2,1,1,null,null,{"$f":"DBCS(D17)&\"秒まつ\"","v":"１秒まつ"},"021/1/","1/","",""]
[16,2,1,3,null,null,{"$f":"DBCS(D18)&\"秒まつ\"","v":"３秒まつ"},{"$f":"IF(B18=-1,C18,TRIM(TEXT(B18,\"00\")&TEXT(C18,\"0\")&\"/\"&I18&J18&K18))","v":"021/3/"},{"$f":"IF(D18<>\"\",IF(D18=\"*\",\"\",D18&\"/\"),\"\")","v":"3/"}]
[17,2,1,5,null,null,{"$f":"DBCS(D19)&\"秒まつ\"","v":"５秒まつ"},"021/5/","5/"]

{"sheet":"CARD","index":1,"n_rows":6,"n_cols":8,"rows_kept":6,"cut":false,"hidden":false,"merged":[]}
[null,null,2,null,7,null,null,8]
["印刷",1,"コマンド",null,"表示",null,null,"コード"]
["リスト",6,{"$f":"VLOOKUP($B3,INDIRECT(sheetname(1)&\"!$A$3:$H$52\"),C$1)","v":2},null,{"$f":"VLOOKUP($B3,INDIRECT(sheetname(1)&\"!$A$3:$H$52\"),E$1)","v":"（　）秒まつ"},null,null,{"$f":"\"*\"&H4&\"*\"","v":"*021/*"}]
[null,null,null,null,null,null,null,{"$f":"VLOOKUP($B3,INDIRECT(sheetname(1)&\"!$A$3:$H$52\"),H$1)","v":"021/"}]
[]
[null,null," ",null,{"$f":"\"\n　\"&E3","v":"\n　（　）秒まつ"}]

{"sheet":"TEST","index":2,"n_rows":22,"n_cols":11,"rows_kept":22,"cut":false,"hidden":false,"merged":[]}
[null,7,null,null,null,null,8]
[null,"説明","バーコード",null,null,null,"CODE","値1","値2","値3",{"$f":"\"*\"&TRIM(G2&H2&I2&J2)&\"*\"","v":"*CODE値1値2値3*"}]
[1,{"$f":"IF($E3<>\"\",VLOOKUP($E3,INDIRECT(sheetname(1)&\"!$A$3:$K$102\"),B$1),\"\")","v":"NEW"},{"$f":"IF(K3=\"\",\"\",\"*\"&K3&\"*\")","v":"*N*"},{"$f":"C3","v":"*N*"},2,{"$f":"B3","v":"NEW"},{"$f":"IF($E3<>\"\",VLOOKUP($E3,INDIRECT(sheetname(1)&\"!$A$3:$K$102\"),G$1),\"\")","v":"N"},null,null,null,{"$f":"TRIM(G3&H3&I3&J3)","v":"N"}]
[2,"くりかえし（　）回",{"$f":"IF(K4=\"\",\"\",\"*\"&K4&\"*\")","v":"*721/3/*"},{"$f":"C4","v":"*721/3/*"},9,{"$f":"B4","v":"くりかえし（　）回"},{"$f":"IF($E4<>\"\",VLOOKUP($E4,INDIRECT(sheetname(1)&\"!$A$3:$K$102\"),G$1),\"\")","v":"721/"},"3/",null,null,{"$f":"TRIM(G4&H4&I4&J4)","v":"721/3/"}]
[3,{"$f":"IF($E5<>\"\",VLOOKUP($E5,INDIRECT(sheetname(1)&\"!$A$3:$K$102\"),B$1),\"\")","v":"ＬＥＤ"},{"$f":"IF(K5=\"\",\"\",\"*\"&K5&\"*\")","v":"*011/1/*"},{"$f":"C5","v":"*011/1/*"},5,"ＬＥＤ",{"$f":"IF($E5<>\"\",VLOOKUP($E5,INDIRECT(sheetname(1)&\"!$A$3:$K$102\"),G$1),\"\")","v":"011/"},"1/",null,null,"011/1/"]
[4,{"$f":"IF($E6<>\"\",VLOOKUP($E6,INDIRECT(sheetname(1)&\"!$A$3:$K$102\"),B$1),\"\")","v":"（　）秒まつ"},{"$f":"IF(K6=\"\",\"\",\"*\"&K6&\"*\")","v":"*021/3/*"},{"$f":"C6","v":"*021/3/*"},6,"（　）秒まつ","021/","3/",null,null,"021/3/"]
[5,"ＬＥＤ","*011/0/*",{"$f":"C7","v":"*011/0/*"},5,"ＬＥＤ","011/","0/",null,null,"011/0/"]
[6,"（　）秒まつ","*021/3/*",{"$f":"C8","v":"*021/3/*"},6,"（　）秒まつ","021/","3/",null,null,"021/3/"]
[7,"くりかえす","*730/*",{"$f":"C9","v":"*730/*"},10,"くりかえす","730/",null,null,null,"730/"]
[8,"RUN","*R*",{"$f":"C10","v":"*R*"},4,"RUN","R",null,null,null,"R"]
[9,"","",null,null,"","",null,null,null,""]
[10,"","",null,null,"","",null,null,null,""]
[11,"","",null,null,"","",null,null,null,""]
[12,"","",null,null,"","",null,null,null,""]
[13,"","",null,null,"","",null,null,null,""]
[14,"","",null,null,"","",null,null,null,""]
[15,"","",null,null,{"$f":"B17","v":""},"",null,null,null,""]
[16,"","",null,null,{"$f":"B18","v":""},"",null,null,null,""]
[17,"","",null,null,"","",null,null,null,""]
[18,"","",null,null,"","",null,null,null,""]
[19,"","",null,null,"","",null,null,null,""]
[20,"","",null,null,"","",null,null,null,""]

{"sheet":"NUM","index":3,"n_rows":16,"n_cols":4,"rows_kept":16,"cut":false,"hidden":false,"merged":[]}
["数値入力用バーコードシート　数字を続けてスキャンして　/で確定"]
[]
[]
[null,{"$f":"\"*/*\"","v":"*/*"}]
[null,"/",null,{"$f":"\"*\"&D6&\"*\"","v":"*-*"}]
[null,{"$f":"\"*\"&B7&\"*\"","v":"*0*"},null,"-"]
[null,0,null,{"$f":"\"*\"&D8&\"*\"","v":"*5*"}]
[null,{"$f":"\"*\"&B9&\"*\"","v":"*1*"},null,5]
[null,1,null,{"$f":"\"*\"&D10&\"*\"","v":"*6*"}]
[null,{"$f":"\"*\"&B11&\"*\"","v":"*2*"},null,6]
[null,2,null,{"$f":"\"*\"&D12&\"*\"","v":"*7*"}]
[null,{"$f":"\"*\"&B13&\"*\"","v":"*3*"},null,7]
[null,3,null,{"$f":"\"*\"&D14&\"*\"","v":"*8*"}]
[null,{"$f":"\"*\"&B15&\"*\"","v":"*4*"},null,8]
[null,4,null,{"$f":"\"*\"&D16&\"*\"","v":"*9*"}]
[null,null,null,9]

{"sheet":"TERM","index":4,"n_rows":25,"n_cols":7,"rows_kept":25,"cut":false,"hidden":false,"merged":[]}
["COM",3,10,100,null,null,"NEW"]
[null,null,"文字間","行間"]
[null,null,null,null,null,null,"10 'CARD-LD"]
[null,null,null,null,null,null,"20 @C:K=INKEY():IFK<>0GOTO@C"]
[null,null,null,null,null,null,"30 UART 0,1:CLS:?\"Ichigo CARD Loader\":?"]
[null,null,null,null,null,null,"40 @ST:?\"[\";P;\"] \";:N=0:M=1"]
[null,null,null,null,null,null,"50 @K:K=INKEY():IFK=0GOTO@K"]
[null,null,null,null,null,null,"60 IF(K>96)*(K<123)K=K-32"]
[null,null,null,null,null,null,"70 IFK=78?:P=0:[P]=0:RUN"]
[null,null,null,null,null,null,"80 IFK=69?:END"]
[null,null,null,null,null,null,"90 IFK=82:?:LRUNFILE()+1"]
[null,null,null,null,null,null,"100 IFK=45M=-1:GOTO@K"]
[null,null,null,null,null,null,"110 IFK=13GOTO@K"]
[null,null,null,null,null,null,"120 IFK=10GOTO@K"]
[null,null,null,null,null,null,"130 IF(K>47)*(K<58)N=N*10+M*(K-48):GOTO@K"]
[null,null,null,null,null,null,"140 ?N:[P]=N:P=P+1:[P]=0"]
[null,null,null,null,null,null,"150 GOTO@ST"]
[]
[]
[]
[]
[]
[]
[]
[null,null,null,null,null,null,"SAVE 0"]